Cruisers Forum
 


Join CruisersForum Today

Reply
 
Thread Tools Rate Thread Display Modes
Old 19-09-2010, 00:58   #1
Sponsoring Vendor

Community Sponsor

Join Date: Aug 2008
Posts: 33
Fedora 13 Compilation Failure . . .

I was successful compiling and installing the following to Fedora 12
A subsequent update to Fedora 13 failed to affect the installation in any way.

Source code: opencpn-1.3.6.tar.bz2
WxWidgets-2.8.10.tar.gz
zyGrib-3.8.6-5.1.i586.rpm from OpenSuse repository - works.

Now, my attempt to compile and install the latest CVN of opencpn (2.1.624a-Source.tar.gz) ffails. wxWidgets (2.9.1) compiles and installs without error.

Many error messages:

make
Scanning dependencies of target GRIB
[ 0%] Building CXX object CMakeFiles/GRIB.dir/src/grib.cpp.o
In file included from /home/armido/Downloads/OpenCPN-2.1.624a-Source/include/grib.h:41,
from /home/armido/Downloads/OpenCPN-2.1.624a-Source/src/grib.cpp:43:
/home/armido/Downloads/OpenCPN-2.1.624a-Source/include/chart1.h:477: warning: type attributes ignored after type is already defined
In file included from /home/armido/Downloads/OpenCPN-2.1.624a-Source/include/grib.h:42,
from /home/armido/Downloads/OpenCPN-2.1.624a-Source/src/grib.cpp:43:
/home/armido/Downloads/OpenCPN-2.1.624a-Source/include/navutil.h:549: warning: type attributes ignored after type is already defined
/home/armido/Downloads/OpenCPN-2.1.624a-Source/include/navutil.h:551: warning: type attributes ignored after type is already defined
In file included from /home/armido/Downloads/OpenCPN-2.1.624a-Source/src/grib.cpp:43:
/home/armido/Downloads/OpenCPN-2.1.624a-Source/include/grib.h:232: error: ISO C++ forbids declaration of ‘wxGraphicsContext’ with no type
/home/armido/Downloads/OpenCPN-2.1.624a-Source/include/grib.h:232: error: expected ‘;’ before ‘*’ token
/home/armido/Downloads/OpenCPN-2.1.624a-Source/src/grib.cpp: In member function ‘bool GRIBOverlayFactory::RenderGribOverlay(wxMemoryDC*, ViewPort*)’:
/home/armido/Downloads/OpenCPN-2.1.624a-Source/src/grib.cpp:857: error: ‘m_pgc’ was not declared in this scope
/home/armido/Downloads/OpenCPN-2.1.624a-Source/src/grib.cpp:857: error: ‘wxGraphicsContext’ has not been declared
/home/armido/Downloads/OpenCPN-2.1.624a-Source/src/grib.cpp:955: error: type ‘<type error>’ argument given to ‘delete’, expected pointer
/home/armido/Downloads/OpenCPN-2.1.624a-Source/src/grib.cpp: In member function ‘void GRIBOverlayFactory::drawTransformedLine(wxMemoryDC *, wxPen, double, double, int, int, int, int, int, int)’:
/home/armido/Downloads/OpenCPN-2.1.624a-Source/src/grib.cpp:1888: error: ‘m_pgc’ was not declared in this scope
make[2]: *** [CMakeFiles/GRIB.dir/src/grib.cpp.o] Error 1
make[1]: *** [CMakeFiles/GRIB.dir/all] Error 2
make: *** [all] Error 2
[armido@hp OpenCPN-2.1.624a-Source]$



Will attempt now to get things working using
WxWidgets-2.8.10.tar.gz and report my results...

svarmido
PorkLoin is offline   Reply With Quote
Old 19-09-2010, 01:56   #2
Registered User

Join Date: Dec 2005
Location: WNA
Boat: Dufour 35
Posts: 3,247
svarmido

I can see one problem here. OpenCPN has not been ported to the Wx 2.9 series. You have to use a WxWidget 2.8.XX release.

Please note that 2.1.624a is the last release using CVS, from now on it's all Git. Check separate thread on this subject!

Thomas
__________________

__________________
cagney is offline   Reply With Quote
Old 19-09-2010, 15:22   #3
Sponsoring Vendor

Community Sponsor

Join Date: Aug 2008
Posts: 33
Output from current CVS...

Thomas,

Thanks for your reply. The information in my first post is output from an attempt to make opencpn-2.1.624 from source with 2.9.1 wxWidget from source. I'll be working on this more today and will post my results. Can you take another look at the output now that you know I was using the latest CVS for opencpn and wxWidgets?

Bob
PorkLoin is offline   Reply With Quote
Old 19-09-2010, 17:56   #4
Marine Service Provider
 
bdbcat's Avatar

Join Date: Mar 2008
Posts: 4,882
svarmido....

The killing error is related to wxGraphicsContext. Evidently, the grib.cpp assumes that wxWidgets includes the code for wxGraphicsContext, while it should not depend on this if wxWidgets was built without wxGraphicsContext.

Solution: When you build wxWidgets, make sure that wxGraphicsContext is included by the appropriate ./configure argument.

Better solution:
Move to the current git codebase. CVS codebase is deprecated.

Good Luck
Dave
__________________
bdbcat is offline   Reply With Quote
Old 20-09-2010, 16:51   #5
Sponsoring Vendor

Community Sponsor

Join Date: Aug 2008
Posts: 33
Still encountering errors with opencpn compilation, particularly at make stage. Downloading fresh CVNs of all required packages. Cannot find a git option for wxWidgets. Anybody know if this is possible? Meanwhile, using version downloaded from Wx site.

Thanks,
Bob
PorkLoin is offline   Reply With Quote
Old 20-09-2010, 18:08   #6
Marine Service Provider
 
bdbcat's Avatar

Join Date: Mar 2008
Posts: 4,882
svarmido....

Excuse me if this seems to be too elementary, but lets start from scratch.

1. Can you compile wxWidgets 2.8.xx and run the sample wxWidgets applications?

You may try to configure wxWidgets like this:

../configure --enable-gtk --with-debug_flag --with-debug_info --enable-debug --with-libjpeg LDFLAGS=-rdynamic --without-subdirs --prefix=/usr --enable-graphics_ctx

2. Do you have the git source for opencpn, current from today?

3. Do you have cmake 2.8?

4. Have you run "cmake ." in the opencpn tree root?

5. Have you then run "make" in the opencpn root?

6. What build errors are you seeing?


Persevere!
Dave
__________________
bdbcat is offline   Reply With Quote
Old 20-09-2010, 21:39   #7
Sponsoring Vendor

Community Sponsor

Join Date: Aug 2008
Posts: 33
Shucks!

Everything went swimmingly until opencpn "make".

Output:

[ 9%] Building CXX object CMakeFiles/NMEA0183.dir/src/nmea.cpp.o
In file included from /home/armido/Downloads/FromSVN09_21_10/opencpn/include/chcanv.h:83,
from /home/armido/Downloads/FromSVN09_21_10/opencpn/include/navutil.h:70,
from /home/armido/Downloads/FromSVN09_21_10/opencpn/include/nmea.h:86,
from /home/armido/Downloads/FromSVN09_21_10/opencpn/src/nmea.cpp:54:
/home/armido/Downloads/FromSVN09_21_10/opencpn/include/chart1.h:493: warning: type attributes ignored after type is already defined
In file included from /home/armido/Downloads/FromSVN09_21_10/opencpn/include/nmea.h:86,
from /home/armido/Downloads/FromSVN09_21_10/opencpn/src/nmea.cpp:54:
/home/armido/Downloads/FromSVN09_21_10/opencpn/include/navutil.h:561: warning: type attributes ignored after type is already defined
/home/armido/Downloads/FromSVN09_21_10/opencpn/include/navutil.h:563: warning: type attributes ignored after type is already defined
/home/armido/Downloads/FromSVN09_21_10/opencpn/src/nmea.cpp: In constructor ‘NMEAHandler::NMEAHandler(int, wxFrame*, const wxString&, const wxString&, wxMutex*, bool)’:
/home/armido/Downloads/FromSVN09_21_10/opencpn/src/nmea.cpp:323: error: aggregate ‘version_t check_version’ has incomplete type and cannot be defined
/home/armido/Downloads/FromSVN09_21_10/opencpn/src/nmea.cpp:330: error: ‘VERSION_SET’ was not declared in this scope
/home/armido/Downloads/FromSVN09_21_10/opencpn/src/nmea.cpp:333: error: ‘struct gps_data_t’ has no member named ‘version’
/home/armido/Downloads/FromSVN09_21_10/opencpn/src/nmea.cpp:376: error: ‘WATCH_ENABLE’ was not declared in this scope
/home/armido/Downloads/FromSVN09_21_10/opencpn/src/nmea.cpp: In function ‘void libgps_hook(gps_data_t*, char*, size_t)’:
/home/armido/Downloads/FromSVN09_21_10/opencpn/src/nmea.cpp:553: error: ‘struct gps_data_t’ has no member named ‘satellites_visible’
/home/armido/Downloads/FromSVN09_21_10/opencpn/src/nmea.cpp: In member function ‘int ComPortManager::CloseComPort(int)’:
/home/armido/Downloads/FromSVN09_21_10/opencpn/src/nmea.cpp:2731: warning: suggest explicit braces to avoid ambiguous ‘else’
make[2]: *** [CMakeFiles/NMEA0183.dir/src/nmea.cpp.o] Error 1
make[1]: *** [CMakeFiles/NMEA0183.dir/all] Error 2
make: *** [all] Error 2
[armido@hp build]$

p, li { white-space: pre-wrap; }
PorkLoin is offline   Reply With Quote
Old 20-09-2010, 21:40   #8
Sponsoring Vendor

Community Sponsor

Join Date: Aug 2008
Posts: 33

Shucks!

Everything went swimmingly until opencpn "make".

Output:

[ 9%] Building CXX object CMakeFiles/NMEA0183.dir/src/nmea.cpp.o
In file included from /home/armido/Downloads/FromSVN09_21_10/opencpn/include/chcanv.h:83,
from /home/armido/Downloads/FromSVN09_21_10/opencpn/include/navutil.h:70,
from /home/armido/Downloads/FromSVN09_21_10/opencpn/include/nmea.h:86,
from /home/armido/Downloads/FromSVN09_21_10/opencpn/src/nmea.cpp:54:
/home/armido/Downloads/FromSVN09_21_10/opencpn/include/chart1.h:493: warning: type attributes ignored after type is already defined
In file included from /home/armido/Downloads/FromSVN09_21_10/opencpn/include/nmea.h:86,
from /home/armido/Downloads/FromSVN09_21_10/opencpn/src/nmea.cpp:54:
/home/armido/Downloads/FromSVN09_21_10/opencpn/include/navutil.h:561: warning: type attributes ignored after type is already defined
/home/armido/Downloads/FromSVN09_21_10/opencpn/include/navutil.h:563: warning: type attributes ignored after type is already defined
/home/armido/Downloads/FromSVN09_21_10/opencpn/src/nmea.cpp: In constructor ‘NMEAHandler::NMEAHandler(int, wxFrame*, const wxString&, const wxString&, wxMutex*, bool)’:
/home/armido/Downloads/FromSVN09_21_10/opencpn/src/nmea.cpp:323: error: aggregate ‘version_t check_version’ has incomplete type and cannot be defined
/home/armido/Downloads/FromSVN09_21_10/opencpn/src/nmea.cpp:330: error: ‘VERSION_SET’ was not declared in this scope
/home/armido/Downloads/FromSVN09_21_10/opencpn/src/nmea.cpp:333: error: ‘struct gps_data_t’ has no member named ‘version’
/home/armido/Downloads/FromSVN09_21_10/opencpn/src/nmea.cpp:376: error: ‘WATCH_ENABLE’ was not declared in this scope
/home/armido/Downloads/FromSVN09_21_10/opencpn/src/nmea.cpp: In function ‘void libgps_hook(gps_data_t*, char*, size_t)’:
/home/armido/Downloads/FromSVN09_21_10/opencpn/src/nmea.cpp:553: error: ‘struct gps_data_t’ has no member named ‘satellites_visible’
/home/armido/Downloads/FromSVN09_21_10/opencpn/src/nmea.cpp: In member function ‘int ComPortManager::CloseComPort(int)’:
/home/armido/Downloads/FromSVN09_21_10/opencpn/src/nmea.cpp:2731: warning: suggest explicit braces to avoid ambiguous ‘else’
make[2]: *** [CMakeFiles/NMEA0183.dir/src/nmea.cpp.o] Error 1
make[1]: *** [CMakeFiles/NMEA0183.dir/all] Error 2
make: *** [all] Error 2
[armido@hp build]$

p, li { white-space: pre-wrap; }
PorkLoin is offline   Reply With Quote
Old 20-09-2010, 23:20   #9
Sponsoring Vendor

Community Sponsor

Join Date: Aug 2008
Posts: 33
After using your configuration options for wxWidgets I tried again...

Output:

[ 9%] Building CXX object CMakeFiles/NMEA0183.dir/src/nmea.cpp.o
In file included from /home/armido/Downloads/FromSVN09_21_10/opencpn/include/chcanv.h:82,
from /home/armido/Downloads/FromSVN09_21_10/opencpn/include/navutil.h:69,
from /home/armido/Downloads/FromSVN09_21_10/opencpn/include/nmea.h:85,
from /home/armido/Downloads/FromSVN09_21_10/opencpn/src/nmea.cpp:53:
/home/armido/Downloads/FromSVN09_21_10/opencpn/include/chart1.h:493: warning: type attributes ignored after type is already defined
In file included from /home/armido/Downloads/FromSVN09_21_10/opencpn/include/nmea.h:85,
from /home/armido/Downloads/FromSVN09_21_10/opencpn/src/nmea.cpp:53:
/home/armido/Downloads/FromSVN09_21_10/opencpn/include/navutil.h:561: warning: type attributes ignored after type is already defined
/home/armido/Downloads/FromSVN09_21_10/opencpn/include/navutil.h:563: warning: type attributes ignored after type is already defined
/home/armido/Downloads/FromSVN09_21_10/opencpn/src/nmea.cpp: In constructor ‘NMEAHandler::NMEAHandler(int, wxFrame*, const wxString&, const wxString&, wxMutex*, bool)’:
/home/armido/Downloads/FromSVN09_21_10/opencpn/src/nmea.cpp:323: error: aggregate ‘version_t check_version’ has incomplete type and cannot be defined
/home/armido/Downloads/FromSVN09_21_10/opencpn/src/nmea.cpp:330: error: ‘VERSION_SET’ was not declared in this scope
/home/armido/Downloads/FromSVN09_21_10/opencpn/src/nmea.cpp:333: error: ‘struct gps_data_t’ has no member named ‘version’
/home/armido/Downloads/FromSVN09_21_10/opencpn/src/nmea.cpp:376: error: ‘WATCH_ENABLE’ was not declared in this scope
/home/armido/Downloads/FromSVN09_21_10/opencpn/src/nmea.cpp: In function ‘void libgps_hook(gps_data_t*, char*, size_t)’:
/home/armido/Downloads/FromSVN09_21_10/opencpn/src/nmea.cpp:553: error: ‘struct gps_data_t’ has no member named ‘satellites_visible’
/home/armido/Downloads/FromSVN09_21_10/opencpn/src/nmea.cpp: In member function ‘int ComPortManager::CloseComPort(int)’:
/home/armido/Downloads/FromSVN09_21_10/opencpn/src/nmea.cpp:2731: warning: suggest explicit braces to avoid ambiguous ‘else’
make[2]: *** [CMakeFiles/NMEA0183.dir/src/nmea.cpp.o] Error 1
make[1]: *** [CMakeFiles/NMEA0183.dir/all] Error 2
make: *** [all] Error 2
[root@hp opencpn]# git clone git://opencpn.git.sourceforge.net/gitroot/opencpn/opencpn
Cloning into opencpn...
remote: Counting objects: 1471, done.
remote: Compressing objects: 100% (1202/1202), done.
remote: Total 1471 (delta 693), reused 757 (delta 237)
Receiving objects: 100% (1471/1471), 23.62 MiB | 263 KiB/s, done.
Resolving deltas: 100% (693/693), done.
[root@hp opencpn]#
PorkLoin is offline   Reply With Quote
Old 20-09-2010, 23:38   #10
Sponsoring Vendor

Community Sponsor

Join Date: Aug 2008
Posts: 33
Here is the whole enchilada from "cmake" to failure to build...

[armido@hp build]$ cmake /home/armido/Downloads/FromSVN09_21_10/opencpn
-- The C compiler identification is GNU
-- The CXX compiler identification is GNU
-- Check for working C compiler: /usr/lib/ccache/gcc
-- Check for working C compiler: /usr/lib/ccache/gcc -- works
-- Detecting C compiler ABI info
-- Detecting C compiler ABI info - done
-- Check for working CXX compiler: /usr/lib/ccache/c++
-- Check for working CXX compiler: /usr/lib/ccache/c++ -- works
-- Detecting CXX compiler ABI info
-- Detecting CXX compiler ABI info - done
-- *** Building opencpn 2.2.918 ***
-- *** Building PlugIns ***
-- *** Building grib_pi ***
-- Found wxWidgets: TRUE
-- *** Building dashboard_pi ***
-- *** Building celestial_navigation_pi ***
-- Found GTK2_GTK: /usr/local/lib/libgtk-x11-2.0.so
-- Looking for XOpenDisplay in /usr/lib/libX11.so;/usr/lib/libXext.so
-- Looking for XOpenDisplay in /usr/lib/libX11.so;/usr/lib/libXext.so - found
-- Looking for gethostbyname
-- Looking for gethostbyname - found
-- Looking for connect
-- Looking for connect - found
-- Looking for remove
-- Looking for remove - found
-- Looking for shmat
-- Looking for shmat - found
-- Looking for IceConnectionNumber in ICE
-- Looking for IceConnectionNumber in ICE - found
-- Found X11: /usr/lib/libX11.so
-- GPSD Library support: enabled
-- Found gps: /usr/lib/libgps.so
-- Building with libgps includes
-- S57 ENC support: enabled
-- Garmin Host Mode support: enabled
-- Writing spec file...
-- Configuring done
-- Generating done
-- Build files have been written to: /home/armido/Downloads/FromSVN09_21_10/opencpn/build
[armido@hp build]$ make
Scanning dependencies of target GARMINHOST
[ 0%] Building C object CMakeFiles/GARMINHOST.dir/src/garmin/jeeps/gpsapp.c.o
[ 0%] Building C object CMakeFiles/GARMINHOST.dir/src/garmin/jeeps/gpscom.c.o
[ 1%] Building C object CMakeFiles/GARMINHOST.dir/src/garmin/jeeps/gpsmath.c.o
[ 1%] Building C object CMakeFiles/GARMINHOST.dir/src/garmin/jeeps/gpsmem.c.o
[ 2%] Building C object CMakeFiles/GARMINHOST.dir/src/garmin/jeeps/gpsprot.c.o
[ 2%] Building C object CMakeFiles/GARMINHOST.dir/src/garmin/jeeps/gpsread.c.o
[ 3%] Building C object CMakeFiles/GARMINHOST.dir/src/garmin/jeeps/gpsdevice.c.o
[ 3%] Building C object CMakeFiles/GARMINHOST.dir/src/garmin/jeeps/gpsdevice_ser.c.o
[ 4%] Building C object CMakeFiles/GARMINHOST.dir/src/garmin/jeeps/gpsdevice_usb.c.o
[ 4%] Building C object CMakeFiles/GARMINHOST.dir/src/garmin/jeeps/gpsrqst.c.o
[ 5%] Building C object CMakeFiles/GARMINHOST.dir/src/garmin/jeeps/gpssend.c.o
[ 5%] Building C object CMakeFiles/GARMINHOST.dir/src/garmin/jeeps/gpsserial.c.o
[ 6%] Building C object CMakeFiles/GARMINHOST.dir/src/garmin/jeeps/gpsutil.c.o
[ 6%] Building C object CMakeFiles/GARMINHOST.dir/src/garmin/jeeps/gpsusbread.c.o
[ 7%] Building C object CMakeFiles/GARMINHOST.dir/src/garmin/jeeps/gpsusbsend.c.o
[ 7%] Building C object CMakeFiles/GARMINHOST.dir/src/garmin/jeeps/gpsusbcommon.c.o
[ 8%] Building C object CMakeFiles/GARMINHOST.dir/src/garmin/jeeps/garmin_wrapper_utils.c.o
[ 8%] Building CXX object CMakeFiles/GARMINHOST.dir/src/garmin/jeeps/garmin_wrapper.cpp.o
In file included from /home/armido/Downloads/FromSVN09_21_10/opencpn/include/chcanv.h:83,
from /home/armido/Downloads/FromSVN09_21_10/opencpn/include/navutil.h:70,
from /home/armido/Downloads/FromSVN09_21_10/opencpn/src/garmin/jeeps/garmin_wrapper.h:33,
from /home/armido/Downloads/FromSVN09_21_10/opencpn/src/garmin/jeeps/garmin_wrapper.cpp:23:
/home/armido/Downloads/FromSVN09_21_10/opencpn/include/chart1.h:493: warning: type attributes ignored after type is already defined
In file included from /home/armido/Downloads/FromSVN09_21_10/opencpn/src/garmin/jeeps/garmin_wrapper.h:33,
from /home/armido/Downloads/FromSVN09_21_10/opencpn/src/garmin/jeeps/garmin_wrapper.cpp:23:
/home/armido/Downloads/FromSVN09_21_10/opencpn/include/navutil.h:561: warning: type attributes ignored after type is already defined
/home/armido/Downloads/FromSVN09_21_10/opencpn/include/navutil.h:563: warning: type attributes ignored after type is already defined
Linking CXX static library libGARMINHOST.a
[ 8%] Built target GARMINHOST
Scanning dependencies of target NMEA0183
[ 9%] Building CXX object CMakeFiles/NMEA0183.dir/src/nmea.cpp.o
In file included from /home/armido/Downloads/FromSVN09_21_10/opencpn/include/chcanv.h:83,
from /home/armido/Downloads/FromSVN09_21_10/opencpn/include/navutil.h:70,
from /home/armido/Downloads/FromSVN09_21_10/opencpn/include/nmea.h:86,
from /home/armido/Downloads/FromSVN09_21_10/opencpn/src/nmea.cpp:54:
/home/armido/Downloads/FromSVN09_21_10/opencpn/include/chart1.h:493: warning: type attributes ignored after type is already defined
In file included from /home/armido/Downloads/FromSVN09_21_10/opencpn/include/nmea.h:86,
from /home/armido/Downloads/FromSVN09_21_10/opencpn/src/nmea.cpp:54:
/home/armido/Downloads/FromSVN09_21_10/opencpn/include/navutil.h:561: warning: type attributes ignored after type is already defined
/home/armido/Downloads/FromSVN09_21_10/opencpn/include/navutil.h:563: warning: type attributes ignored after type is already defined
/home/armido/Downloads/FromSVN09_21_10/opencpn/src/nmea.cpp: In constructor ‘NMEAHandler::NMEAHandler(int, wxFrame*, const wxString&, const wxString&, wxMutex*, bool)’:
/home/armido/Downloads/FromSVN09_21_10/opencpn/src/nmea.cpp:323: error: aggregate ‘version_t check_version’ has incomplete type and cannot be defined
/home/armido/Downloads/FromSVN09_21_10/opencpn/src/nmea.cpp:330: error: ‘VERSION_SET’ was not declared in this scope
/home/armido/Downloads/FromSVN09_21_10/opencpn/src/nmea.cpp:333: error: ‘struct gps_data_t’ has no member named ‘version’
/home/armido/Downloads/FromSVN09_21_10/opencpn/src/nmea.cpp:376: error: ‘WATCH_ENABLE’ was not declared in this scope
/home/armido/Downloads/FromSVN09_21_10/opencpn/src/nmea.cpp: In function ‘void libgps_hook(gps_data_t*, char*, size_t)’:
/home/armido/Downloads/FromSVN09_21_10/opencpn/src/nmea.cpp:553: error: ‘struct gps_data_t’ has no member named ‘satellites_visible’
/home/armido/Downloads/FromSVN09_21_10/opencpn/src/nmea.cpp: In member function ‘int ComPortManager::CloseComPort(int)’:
/home/armido/Downloads/FromSVN09_21_10/opencpn/src/nmea.cpp:2731: warning: suggest explicit braces to avoid ambiguous ‘else’
make[2]: *** [CMakeFiles/NMEA0183.dir/src/nmea.cpp.o] Error 1
make[1]: *** [CMakeFiles/NMEA0183.dir/all] Error 2
make: *** [all] Error 2
[armido@hp build]$
PorkLoin is offline   Reply With Quote
Reply

Thread Tools
Display Modes Rate This Thread
Rate This Thread:

Posting Rules
You may not post new threads
You may not post replies
You may not post attachments
You may not edit your posts

BB code is On
Smilies are On
[IMG] code is On
HTML code is Off
Trackbacks are Off
Pingbacks are Off
Refbacks are Off


Similar Threads
Thread Thread Starter Forum Replies Last Post
Jabsco Macerator Failure forsailbyowner Plumbing Systems and Fixtures 0 12-04-2010 11:29
Compiling on Fedora 12 teejayevans OpenCPN 29 01-04-2010 01:34
Compiling OpenCPN on Fedora 12 inSaNo OpenCPN 9 08-12-2009 05:09
rig failure? irwinsailor Dollars & Cents 3 18-02-2008 08:26
In the Event of Rig Failure GordMay Health, Safety & Related Gear 0 01-08-2004 05:36



Copyright 2002- Social Knowledge, LLC All Rights Reserved.

All times are GMT -7. The time now is 21:10.


Google+
Powered by vBulletin® Version 3.8.8 Beta 1
Copyright ©2000 - 2017, vBulletin Solutions, Inc.
Social Knowledge Networks
Powered by vBulletin® Version 3.8.8 Beta 1
Copyright ©2000 - 2017, vBulletin Solutions, Inc.

ShowCase vBulletin Plugins by Drive Thru Online, Inc.